BDBM50532312 CHEMBL4450729
SMILES CCn1ccnc1[C@]1(CNC(=O)c2cc3cc(ccc3o2)C(F)(F)F)NC(=O)NC1=O
InChI Key InChIKey=CVBUIFHDZMEAIE-SFHVURJKSA-N
Data  22 IC50
  Tab Delimited (TSV)   2D SDfile   Computed 3D by Vconf -m prep SDfile
Find this compound or compounds like it in BindingDB:
Activity Spreadsheet -- Enzyme Inhibition Constant Data from BindingDB
Found 4 hits for monomerid = 50532312
TargetA disintegrin and metalloproteinase with thrombospondin motifs 5(Homo sapiens (Human))
Eli Lilly
Curated by ChEMBL
LigandPNGBDBM50532312(CHEMBL4450729)
Affinity DataIC50:  67nM. Assay description: Inhibition of human ADAMTS5 using 43-mer-VQTVTWPDMELPLPRNITEGEARGSVILTVKPIFEVSPSPLKG as substrate in presence of Lewis rat plasma measured after 3 hr...
Ligand InfoPC cidPC sid
In DepthDetails ArticlePubMed
TargetA disintegrin and metalloproteinase with thrombospondin motifs 5(Homo sapiens (Human))
Eli Lilly
Curated by ChEMBL
LigandPNGBDBM50532312(CHEMBL4450729)
Affinity DataIC50:  67nM. Assay description: Inhibition of human ADAMTS5 using 43-mer-VQTVTWPDMELPLPRNITEGEARGSVILTVKPIFEVSPSPLKG as substrate in presence of Lewis rat plasma measured after 3 hr...
Ligand InfoPC cidPC sid
In DepthDetails ArticlePubMed
TargetA disintegrin and metalloproteinase with thrombospondin motifs 5(Homo sapiens (Human))
Eli Lilly
Curated by ChEMBL
LigandPNGBDBM50532312(CHEMBL4450729)
Affinity DataIC50:  4nM. Assay description: Inhibition of human ADAMTS5 using 43-mer VQTVTWPDMELPLPRNITEGEARGSVILTVKPIFEVSPSPLKG as substrate measured after 3 hrs by AlphaScreen assay
Ligand InfoPC cidPC sid
In DepthDetails ArticlePubMed
TargetA disintegrin and metalloproteinase with thrombospondin motifs 5(Homo sapiens (Human))
Eli Lilly
Curated by ChEMBL
LigandPNGBDBM50532312(CHEMBL4450729)
Affinity DataIC50:  4nM. Assay description: Inhibition of human ADAMTS5 using 43-mer VQTVTWPDMELPLPRNITEGEARGSVILTVKPIFEVSPSPLKG as substrate measured after 3 hrs by AlphaScreen assay
Ligand InfoPC cidPC sid
In DepthDetails ArticlePubMed